{"text_format":"1","workbook":"xlsx","n_sheets":21,"sheets":["COVER","INDEX","Basic Instructions","Methodology","Validation rules","GETTING STARTED","Footnotes list","Reporting","Quality report","ErrorLog","MacroBehaviour","Lists","Lists_Specific","Changelog","Summations","Mandatory","MustNotBeNegative","IsFormula","FootnoteContent","IsNumeric","Locks"],"not_rendered":{"charts":0,"images":3,"macros":1,"external_links":2,"defined_names":49,"comments":0,"pivot_tables":0},"unopened":[],"bounds":{"document_bytes":16777216,"sheet_cells":100000,"rows_first":2000,"rows_last":500,"rows_between":2000,"halvings":0,"cell_chars":16384,"cell_head_chars":4096},"cells_cut":0,"cells_raw":0,"read":"whole","date_system":"1900"}

{"sheet":"COVER","index":0,"n_rows":9,"n_cols":3,"rows_kept":9,"cut":false,"hidden":false,"merged":[]}
[]
[]
[null,null,{"$f":"UPPER(Lists!K3)","v":"STATISTICAL OFFICE OF THE EUROPEAN UNION"}]
[]
[null,null,{"$f":"Lists!K4","v":"Directorate E: Sectoral and regional statistics"}]
[null,null,{"$f":"Lists!K5","v":"Unit E-2: Environmental statistics and accounts; sustainable development"}]
[null,null,{"$f":"UPPER(Lists!K7)","v":"ANNUAL REPORTING OF CONSTRUCTION AND DEMOLITION WASTE"}]
[null,null,{"$f":"CONCATENATE(Lists!K8,\" DATA COLLECTION\")","v":"2025 DATA COLLECTION"}]
[null,null,{"$f":"CONCATENATE(\"Launching date: \",Lists!K9)","v":"Launching date: 22 May 2025"}]

{"sheet":"INDEX","index":1,"n_rows":22,"n_cols":5,"rows_kept":22,"cut":false,"hidden":false,"merged":[[19,2,19,4],[1,2,1,4],[3,2,3,4],[4,2,4,4],[6,2,6,4],[8,2,8,4],[13,2,13,4]]}
[]
[]
[null,null,null,null,{"$f":"UPPER(Lists!K3)","v":"STATISTICAL OFFICE OF THE EUROPEAN UNION"}]
[null,null,{"$f":"UPPER(Lists!K7)","v":"ANNUAL REPORTING OF CONSTRUCTION AND DEMOLITION WASTE"}]
[null,null,{"$f":"CONCATENATE(Lists!K8,\" DATA COLLECTION\")","v":"2025 DATA COLLECTION"}]
[]
[null,null," INDEX - STRUCTURE OF THE QUESTIONNAIRE"]
[]
[null,null,"I. Basic information"]
[null,null,"TITLE","DESCRIPTION","TYPE"]
[null,null,"Index","Structure of the questionnaire","for information"]
[null,null,"Basic instructions ","Basic instructions","for reading before filling in the questionnaire"]
[null,null,"Methodology","Methodology and legal acts","for reading before filling in the questionnaire"]
[null,null,"II. Reporting data (To be filled in by the country)"]
[null,null,"TITLE","DESCRIPTION","TYPE"]
{"$rows_left_out":8}
{"sheet":"Basic Instructions","index":2,"n_rows":92,"n_cols":6,"rows_kept":92,"cut":false,"hidden":false,"merged":[[89,2,89,5],[90,2,90,5],[91,2,91,5],[10,2,10,5],[85,2,85,5],[87,2,87,5],[80,2,80,5],[82,2,82,5],[84,2,84,5],[86,2,86,5],[88,2,88,5],[21,2,21,5],[13,2,13,5],[36,2,36,5],[50,2,50,5],[45,2,45,5],[19,2,19,5],[34,2,34,5],[23,2,23,5],[27,2,27,5],[41,2,41,5],[17,2,17,5],[3,2,3,5],[4,2,4,5],[6,2,6,5],[7,2,7,5],[8,2,8,5],[64,2,64,5],[42,2,42,5],[53,2,53,5],[48,2,48,5],[49,2,49,5],[75,2,75,5],[76,2,76,5],[70,2,70,5],[71,2,71,5],[73,2,73,5],[78,2,78,5],[79,2,79,5],[92,2,92,5],[11,2,11,5],[16,2,16,5],[14,2,14,5],[15,2,15,5],[12,2,12,5],[77,2,77,5],[62,2,62,5],[54,3,54,5],[60,2,60,5],[61,2,61,5],[66,2,66,5],[67,2,67,5],[69,2,69,5]]}
[]
[]
[null,null,null,null,null,{"$f":"UPPER(Lists!K3)","v":"STATISTICAL OFFICE OF THE EUROPEAN UNION"}]
[null,null,{"$f":"UPPER(Lists!K7)","v":"ANNUAL REPORTING OF CONSTRUCTION AND DEMOLITION WASTE"}]
[null,null,{"$f":"CONCATENATE(Lists!K8,\" DATA COLLECTION\")","v":"2025 DATA COLLECTION"}]
[]
[null,null,"BASIC INSTRUCTIONS"]
[null,null,"Before filling in the questionnaire please read carefully the instructions below. This EXCEL workbook is the questionnaire. Please do not  delete or add rows in the questionnaire (except where instructed in the quality report tab)."]
[null,null,{"$f":"CONCATENATE(\"Please do not  delete or add rows in the questionnaire (except where instructed in the quality report tabs). We kindly ask you to send us the data latest by \",Lists!K10)","v":"Please do not  delete or add rows in the questionnaire (except where instructed in the quality report tabs). We kindly ask you to send us the data latest by 30 June 2025"}]
[]
[null,null,"Before submitting the questionnaire to Eurostat, It is strongly recommended to use 'Validate questionnaire’ button included in each table to streamline the validation workflow; this will avoid unnecessary iterations between your organisation and Eurostat. You can consult the errors in the ‘ErrorLog’ worksheet. Please revise/correct the questionnaire until the check runs without highlighting errors or warnings. "]
[null,null,"Table of contents"]
[null,null,"1. Data transmission"]
[null,null,"2. Reporting conventions"]
[null,null,"3. Footnotes"]
{"$rows_left_out":78}
{"sheet":"Methodology","index":3,"n_rows":40,"n_cols":6,"rows_kept":40,"cut":false,"hidden":false,"merged":[[36,2,36,5],[37,2,37,5],[38,2,38,5],[39,2,39,5],[28,2,28,5],[29,2,29,5],[30,2,30,5],[31,2,31,5],[27,2,27,5],[3,2,3,5],[4,2,4,5],[6,2,6,5],[7,2,7,5],[8,2,8,5],[22,2,22,5],[26,2,26,5],[9,2,9,5],[17,2,17,5],[19,2,19,5],[10,2,10,5],[14,2,14,5],[15,2,15,5]]}
[]
[]
[null,null,null,null,null,{"$f":"UPPER(Lists!K3)","v":"STATISTICAL OFFICE OF THE EUROPEAN UNION"}]
[null,null,{"$f":"UPPER(Lists!K7)","v":"ANNUAL REPORTING OF CONSTRUCTION AND DEMOLITION WASTE"}]
[null,null,{"$f":"CONCATENATE(Lists!K8,\" DATA COLLECTION\")","v":"2025 DATA COLLECTION"}]
[]
[null,null,"METHODOLOGY AND LEGAL ACTS"]
[null,null,"Table of contents"]
[null,null,"1. Background"]
[null,null,"2. Legal acts"]
[null,null,"3. Data reporting - questionnaire"]
[]
[null,null,"1. Background"]
[]
[null,null,"The European Parliament and the Council adopted the (Waste Framework) Directive 2008/98/EC to reduce the impact of construction and demolition waste on the environment. "]
{"$rows_left_out":26}
{"sheet":"Validation rules","index":4,"n_rows":42,"n_cols":6,"rows_kept":42,"cut":false,"hidden":false,"merged":[[16,2,16,5],[39,2,39,5],[41,2,41,5],[19,2,19,5],[35,2,35,5],[36,2,36,5],[29,2,29,5],[33,2,33,5],[34,2,34,5],[20,2,20,5],[25,2,25,5],[26,2,26,5],[27,2,27,5],[31,2,31,5],[42,2,42,5],[3,2,3,5],[4,2,4,5],[6,2,6,5],[17,2,17,5],[18,2,18,5],[8,2,8,5],[9,2,9,5],[10,2,10,5],[11,3,11,5],[12,3,12,5],[13,2,13,5],[14,2,14,5],[15,3,15,5],[32,2,32,5],[23,2,23,5]]}
[]
[]
[null,null,null,null,null,{"$f":"UPPER(Lists!K3)","v":"STATISTICAL OFFICE OF THE EUROPEAN UNION"}]
[null,null,{"$f":"UPPER(Lists!K7)","v":"ANNUAL REPORTING OF CONSTRUCTION AND DEMOLITION WASTE"}]
[null,null,{"$f":"CONCATENATE(Lists!K8,\" DATA COLLECTION\")","v":"2025 DATA COLLECTION"}]
[]
[null,null,"VALIDATION RULES"]
[]
[null,null,"An automatic validation tool is provided along with this questionnaire. In order to launch the validation process, please use the button \"Validate Questionnaire\", placed on the top left corner of each reporting table."]
[null,null,"The validation process evaluates a list of predefined logical and arithmetic statements, such as \"a value exists in this cell\" or \"A = A01+A02+A03\". These predefined logical and arithmetic statements are called \"Validation rules\". "]
[null,null,"When the criteria defined in a validation rule is not met, the validation process will issue a \"positive\" result (This is same terminology used for medical tests). This \"positive\" result can be an \"error\" or a \"warning\", and will be recorded in the ErrorLog sheet."]
[null,null,null,"A \"warning\" is an issue that requires the attention of the desk officer at Eurostat. It will be further analysed and it might trigger further questions to the data provider."]
[null,null,null,"An \"error\" is an issue that will trigger further question from Eurostat to the data provider and will very likely end with the request from Eurostat for a new data submission."]
[null,null,"The countries are kindly requested to launch the validation tool before submitting the questionnaire, and correct the errors highlighted in the ErrorLog sheet."]
[null,null,"Important facts to notice:"]
{"$rows_left_out":28}
{"sheet":"GETTING STARTED","index":5,"n_rows":23,"n_cols":7,"rows_kept":23,"cut":false,"hidden":false,"merged":[[17,3,17,6],[19,3,19,6],[21,3,21,6],[22,2,22,6],[3,2,3,6],[4,2,4,6],[6,2,6,6],[11,2,11,6],[13,3,13,6],[15,3,15,6]]}
[]
[]
[null,null,null,null,null,null,"STATISTICAL OFFICE OF THE EUROPEAN UNION"]
[null,null,"ANNUAL REPORTING OF CONSTRUCTION AND DEMOLITION WASTE"]
[null,null,{"$f":"CONCATENATE(Lists!K8,\" DATA COLLECTION\")","v":"2025 DATA COLLECTION"}]
[]
[null,null," GETTING STARTED"]
[]
[null,null,"Please select your country (click on the white cell):    ",null,"Finland",null,{"$f":"IF(E9=\"\",\"\",VLOOKUP(E9,Lists!A2:B40,2,FALSE))","v":"FI"}]
[null,null,"Reference year:    ",null,2023]
[null,null,{"$f":"CONCATENATE(\"The due date for reporting is \",Lists!K10)","v":"The due date for reporting is 30 June 2025"}]
[null,null,"Who is the primary contact point for the data collection 'Annual reporting of construction and demolition waste' in your country?"]
[]
[null,null,"Name:","Pia Högmander"]
[]
{"$rows_left_out":9}
{"sheet":"Footnotes list","index":6,"n_rows":58,"n_cols":5,"rows_kept":58,"cut":false,"hidden":false,"merged":[[1,3,1,4],[3,3,3,4],[4,3,4,4],[6,3,6,4],[7,3,7,4]]}
[]
[]
[null,null,null,null,{"$f":"UPPER(Lists!K3)","v":"STATISTICAL OFFICE OF THE EUROPEAN UNION"}]
[null,null,null,{"$f":"UPPER(Lists!K7)","v":"ANNUAL REPORTING OF CONSTRUCTION AND DEMOLITION WASTE"}]
[null,null,null,{"$f":"CONCATENATE(Lists!K8,\" DATA COLLECTION\")","v":"2025 DATA COLLECTION"}]
[]
[null,null,null,"EXPLANATORY FOOTNOTES"]
[null,null,null,{"$f":"IF('GETTING STARTED'!E9=\"\",\"\",'GETTING STARTED'!E9)","v":"Finland"}]
[null,null,null,1,"Type your text here"]
[null,null,null,2]
[null,null,null,3]
[null,null,null,4]
[null,null,null,5]
[null,null,null,6]
[null,null,null,7]
{"$rows_left_out":44}
{"sheet":"Reporting","index":7,"n_rows":19,"n_cols":30,"rows_kept":19,"cut":false,"hidden":false,"merged":[[1,6,1,29],[4,6,4,8],[14,5,14,10],[11,5,11,13],[5,7,6,7],[5,11,6,11],[5,15,6,15],[5,19,6,19],[5,23,6,23],[5,27,6,27],[5,8,6,9],[5,12,6,13],[5,16,6,17],[5,20,6,21],[5,24,6,25],[5,28,6,29]]}
[]
[null,null,null,null,null,null,"Reporting of the implementation of point (b) of Article 11(2) of Directive 2008/98/EC, concerning construction and demolition\n according to the format set out in Annex IV of the Commission Implementing Decisions 2019/1004"]
[null,null,null,null,null,"Country:",{"$f":"'GETTING STARTED'!G9","v":"FI"},{"$f":"IF('GETTING STARTED'!E9=\"\",\"\",'GETTING STARTED'!E9)","v":"Finland"}]
[null,null,null,null,null,"Reference year:",{"$f":"'GETTING STARTED'!E10","v":2023}]
[null,null,null,"calcmeth",null,"Calculation method (1)","REGL_2150_2002",null,null,{"$f":"IF(G5=\"\",\"<= Select the calculation method here\",VLOOKUP(G5,Lists_Specific!A2:B4,2,FALSE))","v":"Data based on Regulation  (EC)  No  2150/2002"}]
[null,null,null,null,null,null,"Waste generated","Standard footnotes","Explanatory\nfootnote",null,"Preparing for re-use","Standard footnotes","Explanatory\nfootnote",null,"Recycling","Standard footnotes","Explanatory\nfootnote",null,"Backfilling","Standard footnotes","Explanatory\nfootnote",null,"Other material recovery(2) ","Standard footnotes","Explanatory\nfootnote",null,"Total material recovery(3)","Standard footnotes","Explanatory\nfootnote"]
[null,null,null,"wst_oper",null,null,"GEN",null,null,null,"PRP_REU",null,null,null,"RCV_R",null,null,null,"RCV_B",null,null,null,"RCV_OTH",null,null,null,"RCV"]
[null,null,null,"UNIT","T","Tonnes",1346120,null,null,{"$f":"IF(TRIM(I8)=\"\", \"\", IF(VLOOKUP(I8,'Footnotes list'!$D$9:$E$107,2,FALSE)=0,\"\",VLOOKUP(I8,'Footnotes list'!$D$9:$E$107,2,FALSE) ) )","v":""},89905,null,null,{"$f":"IF(TRIM(M8)=\"\", \"\", IF(VLOOKUP(M8,'Footnotes list'!$D$9:$E$107,2,FALSE)=0,\"\",VLOOKUP(M8,'Footnotes list'!$D$9:$E$107,2,FALSE) ) )","v":""},588158,null,null,{"$f":"IF(TRIM(Q8)=\"\", \"\", IF(VLOOKUP(Q8,'Footnotes list'!$D$9:$E$107,2,FALSE)=0,\"\",VLOOKUP(Q8,'Footnotes list'!$D$9:$E$107,2,FALSE) ) )","v":""},48246,null,null,{"$f":"IF(TRIM(U8)=\"\", \"\", IF(VLOOKUP(U8,'Footnotes list'!$D$9:$E$107,2,FALSE)=0,\"\",VLOOKUP(U8,'Footnotes list'!$D$9:$E$107,2,FALSE) ) )","v":""},0,null,null,{"$f":"IF(TRIM(Y8)=\"\", \"\", IF(VLOOKUP(Y8,'Footnotes list'!$D$9:$E$107,2,FALSE)=0,\"\",VLOOKUP(Y8,'Footnotes list'!$D$9:$E$107,2,FALSE) ) )","v":""},{"$f":"IF(TRIM(CONCATENATE(K8,O8,S8,W8))=\"\",\"\",SUM(K8,O8,S8,W8))","v":726309},null,null,{"$f":"IF(TRIM(AC8)=\"\", \"\", IF(VLOOKUP(AC8,'Footnotes list'!$D$9:$E$107,2,FALSE)=0,\"\",VLOOKUP(AC8,'Footnotes list'!$D$9:$E$107,2,FALSE) ) )","v":""}]
[]
[]
[null,null,null,null,null,"Notes:"]
[null,null,null,null,null,"(1) Data pursuant to Annex III Decision 2011/753/EU based on Regulation  (EC)  No  2150/2002 or reporting system of the Member State, chose from drop-down-menu in cell G5:\nREGL_2150_2002 = data based on Regulation  (EC)  No  2150/2002\nRS_MS = data based on Reporting system of the Member State\n"]
[null,null,null,null,null,"(2) This includes material recovery other than preparing for re-use, recycling and backfilling."]
[null,null,null,null,null,"(3) This is the sum of the amounts reported under preparing for re-use, recycling, backfilling and other material recovery.\n"]
[null,null,null,null,null,"\n(3) This is the sum of the amounts reported under preparing for re-use, recycling, backfilling and other material recovery.\n"]
{"$rows_left_out":5}
{"sheet":"Quality report","index":8,"n_rows":96,"n_cols":12,"rows_kept":96,"cut":false,"hidden":false,"merged":[[12,1,12,11],[6,0,6,11],[5,0,5,11],[4,0,4,11],[20,0,20,11],[64,0,64,11],[81,0,81,11],[49,0,49,11],[50,0,50,11],[21,0,21,11],[32,0,32,11],[33,0,33,11],[28,0,28,11],[29,0,29,11],[42,0,42,11],[30,0,30,11],[40,0,40,11],[39,0,39,11],[38,0,38,11],[37,0,37,11],[36,0,36,11],[35,0,35,11],[34,0,34,11],[31,0,31,11],[58,5,58,6],[59,5,59,6],[55,7,55,8],[56,7,56,8],[72,0,72,11],[80,0,80,11],[73,1,73,11],[74,1,74,11],[75,1,75,11],[76,1,76,11],[77,1,77,11],[78,1,78,11],[79,1,79,11],[58,1,58,2],[59,1,59,2],[58,3,58,4],[65,0,68,11],[71,0,71,11],[63,0,63,11],[55,1,55,2],[56,1,56,2],[57,1,57,2],[59,3,59,4],[55,3,55,4],[95,0,95,11],[89,0,89,11],[84,1,84,11],[85,1,85,11],[86,1,86,11],[87,1,87,11],[88,1,88,11],[90,0,90,11],[94,0,94,11],[0,3,0,7],[10,1,10,11],[11,1,11,11],[19,0,19,11],[13,1,13,11],[14,1,14,11],[83,0,83,11],[41,0,41,11],[43,0,43,11],[82,0,82,11],[69,0,69,11],[51,0,51,11],[61,0,61,11],[52,1,52,2],[52,3,52,4],[57,7,57,8],[58,7,58,8],[59,7,59,8],[55,9,55,10],[56,9,56,10],[57,9,57,10],[58,9,58,10],[59,9,59,10],[52,5,52,6],[22,4,22,6],[22,10,22,11],[22,1,22,3],[23,1,23,3],[24,1,24,3],[25,1,25,3],[26,1,26,3],[27,1,27,3],[23,4,23,6],[24,4,24,6],[25,4,25,6],[26,4,26,6],[27,4,27,6],[22,7,22,9],[23,7,23,9],[24,7,24,9],[25,7,25,9],[26,7,26,9],[27,7,27,9],[23,10,23,11],[24,10,24,11],[25,10,25,11],[26,10,26,11],[27,10,27,11],[53,1,53,2],[54,1,54,2],[53,3,53,4],[54,3,54,4],[44,3,44,8],[44,9,44,11],[45,9,45,11],[46,9,46,11],[47,9,47,11],[48,9,48,11],[44,0,44,2],[45,0,45,2],[46,0,46,2],[47,0,47,2],[48,0,48,2],[45,3,45,8],[46,3,46,8],[47,3,47,8],[48,3,48,8],[56,3,56,4],[57,3,57,4],[55,5,55,6],[56,5,56,6],[57,5,57,6],[52,7,52,8],[52,9,52,10],[53,9,53,10],[54,9,54,10],[53,7,53,8],[54,7,54,8],[53,5,53,6],[54,5,54,6]]}
[null,null,null,"Construction and demolition waste\nQUALITY REPORT"]
[null,null,null,null,null,null,null,null,null,"STATISTICAL OFFICE OF THE EUROPEAN UNION"]
[null,null," "]
[]
["1. Objective of the report"]
["The objective of this report is to gather information on the data compilation methods and coverage of the submitted data. The report should allow a better understanding of the approaches taken by Member States as well as the possibilities and limits of data comparability across countries."]
["The structure of the quality report follows the structure set out in Commission Implementing Decision (EU) 2019/1004 in most cases. Where there are some differences the intention of the Act is maintained. However, changes have been introduced to ensure the responses are more accurate and easier to fill in by the Member States. Please aim to complete the QR as it is structured, if it is not possible to provide the relevant information explain the reasons why."]
[]
[]
["2. General information"]
["2.1. Member State","Finland"]
["2.2. Organisation submitting the data and the description","Statistics Finland"]
["2.3. Contact person/contact details","Mr. Juha Espo (juha.espo@stat.fi)"]
["2.4. Reference year",2023]
["2.5. Delivery date / version","2025-06-26"]
{"$rows_left_out":82}
{"sheet":"ErrorLog","index":9,"n_rows":8,"n_cols":7,"rows_kept":8,"cut":false,"hidden":false,"merged":[]}
["Link to Error","Validation Rule","Cell","Sheet","Description","Severity","Former Color"]
[null,null,null,null,null,null,16777215]
[null,null,null,null,null,null,16777215]
[null,null,null,null,null,null,16777215]
[null,null,null,null,null,null,16777215]
[null,null,null,null,null,null,16777215]
[null,null,null,null,null,null,16777215]
[null,null,null,null,null,null,12566463]

{"sheet":"MacroBehaviour","index":10,"n_rows":3,"n_cols":7,"rows_kept":3,"cut":false,"hidden":true,"merged":[[0,0,0,2],[0,4,0,6]]}
["COMMON TO ALL (OR MOST)  QUESTIONNAIRE",null,null,null,"SPECIFIC TO THIS QUESTIONNAIRE"]
["Parameter","Value","(Valid values)",null,"Parameter","Value","(Valid values)"]
["DevelopementMode",false,"TRUE (during development)\nFALSE (For real reporting and testing)"]

{"sheet":"Lists","index":11,"n_rows":40,"n_cols":13,"rows_kept":40,"cut":false,"hidden":true,"merged":[[1,9,1,10],[5,9,5,10],[10,9,10,10],[15,9,15,10]]}
["Country label","Country code",null,"Valid flags","Label",null,"Code","Description",null,"Textual variables","String",null,"WASTE-2025-DC"]
["Belgium","BE",null,"B","break in time series",null,"C","confidential",null,"Institutional names"]
["Bulgaria","BG",null,"E","estimated data",null,"D","secondary confidentiality set by the sender",null,"Eurostat Text","Statistical Office of the European Union"]
["Czechia","CZ",null,"P","provisional",null,null,null,null,"Directorate Text","Directorate E: Sectoral and regional statistics"]
["Denmark","DK",null,"BE",null,null,null,null,null,"Unit Text","Unit E-2: Environmental statistics and accounts; sustainable development"]
["Germany","DE",null,"BP",null,null,null,null,null,"Data collection information"]
["Estonia","EE",null,"EP",null,null,null,null,null,"Data Collection Text","Annual reporting of construction and demolition waste"]
["Ireland","IE",null,"BEP",null,null,null,null,null,"Data Collection Year",2025]
["Greece","EL",null,null,null,null,null,null,null,"Launching date","22 May 2025"]
["Spain","ES",null,null,null,null,null,null,null,"Submission deadline","30 June 2025"]
["France","FR",null,null,null,null,null,null,null,"EDAMIS data"]
["Croatia","HR",null,null,null,null,null,null,null,"Domain name","WASTE"]
["Italy","IT",null,null,null,null,null,null,null,"Dataset name","WASTE_CDDATA_A",null,"WASTE-2023-DC"]
["Cyprus","CY",null,null,null,null,null,null,null,"Web page","https://webgate.ec.europa.eu/edamis4 "]
["Latvia","LV",null,null,null,null,null,null,null,"Functional e-mail","ESTAT-DATA-METADATA-SERVICES@ec.europa.eu"]
{"$rows_left_out":26}
{"sheet":"Lists_Specific","index":12,"n_rows":4,"n_cols":2,"rows_kept":4,"cut":false,"hidden":true,"merged":[]}
["Data based on "]
[null,"<= Select the calculation method here"]
["REGL_2150_2002","Data based on Regulation  (EC)  No  2150/2002"]
["RS_MS","Data based on Reporting system of the Member State"]

{"sheet":"Changelog","index":13,"n_rows":26,"n_cols":7,"rows_kept":26,"cut":false,"hidden":true,"merged":[]}
["Changed by","SheetName","Cell","Change","Version","Date","REMARKS"]
["CDD","ALL","ALL","Widely adapt to 2021 style and conventions","00m16","29/03/2021"]
["CDD","Reporting","AA8","Change summation formulas","00m16","29/03/2021"]
["CDD",null,null,"Add Macros v17","00m16","29/03/2021","CDD: I forgot to change the macro version in the filename."]
["CDD",null,null,"Add validation Specific Settings Sheests (SSS)","00m16","29/03/2021"]
["CDD","Validation rules",null,"Add new introductory text to validation rules sheet","01m17","2021-03-31"]
["CDD",null,null,"Change macro version name to v17","01m17","2021-03-31","CDD: Change of version name. Macros were changed before (see line 4)"]
["CC","Metadata",null,"Deleted the sheet Metadata","02m17","2021-04-12"]
["CC","Reporting",null,"1) updated codes for calculation method in the footnotes and in the drop-down menu","02m17","2021-04-12"]
["CC","Reporting","G5","2) Updated the protection of the cell G5 (must be editable)","02m17","2021-04-12"]
["CC","Mandatory",null,"Added cell G5 from reporting","02m17","2021-04-12"]
["CC","Basic Instructions",null,"1) In Annex: How to fill in the data sheets of the questionnaire deleted point 2) on voluntary data","02m17","2021-04-12"]
["CC","Basic Instructions",null,"2) Deleted rows from 43 to 46 referring to Metadata","02m17","2021-04-12"]
["CC","Basic Instructions",null,"3) Deleted rows 69 to 70 referring to Packaging and packaging waste","02m17","2021-04-12"]
["CC","Basic Instructions",null,"4) Row 61 deleted reference to sheet Metadata","02m17","2021-04-12"]
{"$rows_left_out":12}
{"sheet":"Summations","index":14,"n_rows":107,"n_cols":13,"rows_kept":107,"cut":false,"hidden":true,"merged":[[8,5,8,6]]}
["Severity","Sheet Name","List of Cells\n (first block)","First Total Cell (first block)","Last Total Cell\n(Last block)","Row Block Repetition Step","Column Block Repetition Step","Greater or Equal","Valid Tolerance","Only if all data is available","Non compliance Is Valid If Footnote Exists","Footnote Shift From Value","Display text in error"]
["Error","Reporting","K8,O8,S8,W8","AA8","AA8",999,999,"EQ",0.1,"NO","NO",3,"Total material recovery not consistent to the sum of subcomponents"]
["Warning","Reporting","G8","K8","K8",999,999,"LT",0.1,"NO","NO",3,"\"Preparing for reuse\" must be smaller than \"Generation\". If not, please provide clarifications."]
["Warning","Reporting","G8","O8","O8",999,999,"LT",0.1,"NO","NO",3,"\"Recycling\" must be smaller than \"Generation\". If not, please provide clarifications."]
["Warning","Reporting","G8","S8","S8",999,999,"LT",0.1,"NO","NO",3,"\"Backfilling\" must be smaller than \"Generation\". If not, please provide clarifications."]
["Warning","Reporting","G8","W8","W8",999,999,"LT",0.1,"NO","NO",3,"\"Other material recovery\" must be smaller than \"Generation\". If not, please provide clarifications."]
["Warning","Reporting","G8","AA8","AA8",999,999,"LT",0.1,"NO","NO",3,"\"Total material recovery\" must be smaller than Generation. If not, please provide clarifications."]
[]
[null,null,null,null,null,"Must be > 0 for a not relevant dimension. Else you get an infinite loop",null,"EQ or GE or GT or LT","GT does not admit Tolerance","NO or YES"]
[]
["DESCRIPTION"]
["This sheet is meant to define the validation for summations in a row or in a column."]
["- A block is defined as a sequence of addendums in the same row or column"]
["- Only the first block must be explicitly defined"]
["- The block can be repeated at regular patterns through rows and columns at the same time"]
{"$rows_left_out":93}
{"sheet":"Mandatory","index":15,"n_rows":9,"n_cols":9,"rows_kept":9,"cut":false,"hidden":true,"merged":[]}
["Severity","SheetName","Top Left Cell","Bottom Right Cell","Row Step","Column Step","Empty Is Valid If Footnote Exists","Footnote Shift From Value"]
["Error","GETTING STARTED","E9","E10",1,999,"NO",999,"STANDARD FOR ALL QUESTIONNAIRES"]
["Error","GETTING STARTED","D14","D22",2,999,"NO",999]
["Error","Reporting","G5","G5",999,999,"NO",3]
["Error","Reporting","G8","G8",999,999,"YES",3]
["Error","Reporting","K8","K8",999,999,"YES",3]
["Error","Reporting","O8","O8",999,999,"YES",3]
["Error","Reporting","S8","S8",999,999,"YES",3]
["Error","Reporting","W8","W8",999,999,"YES",3]

{"sheet":"MustNotBeNegative","index":16,"n_rows":2,"n_cols":6,"rows_kept":2,"cut":false,"hidden":true,"merged":[]}
["Severity","SheetName","TopLeftCell","BottomRightCell","RowStep","ColumnStep"]
["Error","Reporting","G8","AA8",1,4]

{"sheet":"IsFormula","index":17,"n_rows":2,"n_cols":6,"rows_kept":2,"cut":false,"hidden":true,"merged":[]}
["Severity","Sheet Name","Top Left Cell","Bottom Right Cell","Row Step","Column Step"]
["Info","Reporting","AA8","AA8",999,999]

{"sheet":"FootnoteContent","index":18,"n_rows":2,"n_cols":7,"rows_kept":2,"cut":false,"hidden":true,"merged":[]}
["Severity","SheetName","TopLeftCell","BottomRightCell","RowStep","ColumnStep","DistanceFromReferenceToText"]
["Error","Reporting","I8","AC8",1,4,1]

{"sheet":"IsNumeric","index":19,"n_rows":2,"n_cols":9,"rows_kept":2,"cut":false,"hidden":true,"merged":[]}
["Severity","SheetName","TopLeftCell","BottomRightCell","RowStep","ColumnStep"]
["Error","Reporting","G8","AA8",1,4,null,null,"it is meant to check that there are numerical values"]

{"sheet":"Locks","index":20,"n_rows":2,"n_cols":7,"rows_kept":2,"cut":false,"hidden":true,"merged":[]}
["Sheet Name","Top Left Cell","Bottom Right Cell","Row Step","Column Step","Lock Type","Focus Back To"]
["Reporting","AA8","AA8",999,999,"Formulas","G8"]