{"text_format":"1","workbook":"xlsx","n_sheets":20,"sheets":["COVER","INDEX","Basic Instructions","Methodology","GETTING STARTED","Footnotes list","Table 2 - Material breakdown","Table 3 - Recycling rate","QR Table 2 - Material-breakdown","QR Table 3 - Recycling rate","ErrorLog","IsNumeric","FootnoteContent","Mandatory","MustNotBeNegative","Changelog","Summations","Lists","Lists (specific)","MacroBehaviour"],"not_rendered":{"charts":0,"images":3,"macros":1,"external_links":0,"defined_names":7,"comments":0,"pivot_tables":0},"unopened":[],"bounds":{"document_bytes":16777216,"sheet_cells":100000,"rows_first":2000,"rows_last":500,"rows_between":2000,"halvings":0,"cell_chars":16384,"cell_head_chars":4096},"cells_cut":0,"cells_raw":0,"read":"whole","date_system":"1900"}

{"sheet":"COVER","index":0,"n_rows":9,"n_cols":3,"rows_kept":9,"cut":false,"hidden":false,"merged":[]}
[]
[]
[null,null,{"$f":"UPPER(Lists!K3)","v":"STATISTICAL OFFICE OF THE EUROPEAN UNION"}]
[]
[null,null,{"$f":"Lists!K4","v":"Directorate E: Sectoral and regional statistics"}]
[null,null,{"$f":"Lists!K5","v":"Unit E-2: Environmental statistics and accounts; sustainable development"}]
[null,null,{"$f":"UPPER(Lists!K7)","v":"MUNICIPAL WASTE REPORTING OBLIGATIONS"}]
[null,null,{"$f":"CONCATENATE(Lists!K8,\" DATA COLLECTION\")","v":"2026 DATA COLLECTION"}]
[null,null,{"$f":"CONCATENATE(\"Launching date: \",Lists!K9)","v":"Launching date: 27 May 2026"}]

{"sheet":"INDEX","index":1,"n_rows":23,"n_cols":5,"rows_kept":23,"cut":false,"hidden":false,"merged":[[19,2,19,4],[1,2,1,4],[3,2,3,4],[4,2,4,4],[6,2,6,4],[8,2,8,4],[13,2,13,4]]}
[]
[]
[null,null,null,null,{"$f":"UPPER(Lists!K3)","v":"STATISTICAL OFFICE OF THE EUROPEAN UNION"}]
[null,null,{"$f":"UPPER(Lists!K7)","v":"MUNICIPAL WASTE REPORTING OBLIGATIONS"}]
[null,null,{"$f":"CONCATENATE(Lists!K8,\" DATA COLLECTION\")","v":"2026 DATA COLLECTION"}]
[]
[null,null," INDEX - STRUCTURE OF THE QUESTIONNAIRE"]
[]
[null,null,"I. Basic information"]
[null,null,"TITLE","DESCRIPTION","TYPE"]
{"$rows_left_out":14}
{"sheet":"Basic Instructions","index":2,"n_rows":89,"n_cols":13,"rows_kept":89,"cut":false,"hidden":false,"merged":[[3,2,3,6],[4,2,4,6],[6,2,6,6],[7,2,7,6],[76,2,76,5],[59,3,59,5],[65,2,65,5],[66,2,66,5],[67,2,67,5],[75,2,75,5],[53,2,53,5],[54,2,54,5],[55,2,55,5],[58,2,58,5],[23,2,23,5],[25,2,25,5],[84,2,84,5],[85,2,85,5],[86,2,86,5],[87,2,87,5],[88,2,88,5],[82,2,82,6],[13,2,13,5],[15,2,15,5],[16,2,16,5],[17,2,17,5],[19,2,19,5],[78,2,78,5],[79,2,79,5],[80,2,80,5],[29,2,29,5],[39,2,39,5],[44,2,44,5],[37,2,37,6],[61,3,61,5],[50,2,50,6],[73,2,73,6],[9,2,9,6],[8,2,8,6],[11,10,11,13],[11,14,11,15],[11,2,11,6],[10,2,10,6],[68,2,68,6],[71,2,71,6],[21,2,21,6],[14,2,14,5],[18,2,18,5]]}
[]
[]
[null,null,null,null,null,{"$f":"UPPER(Lists!K3)","v":"STATISTICAL OFFICE OF THE EUROPEAN UNION"}]
[null,null,{"$f":"UPPER(Lists!K7)","v":"MUNICIPAL WASTE REPORTING OBLIGATIONS"}]
[null,null,{"$f":"CONCATENATE(Lists!K8,\" DATA COLLECTION\")","v":"2026 DATA COLLECTION"}]
[]
[null,null,"BASIC INSTRUCTIONS"]
[null,null,"This questionnaire is designed to collect  Municipal waste reporting obligations. It contains 2 tables, each of them with their corresponding quality report; each of the quality reports needs to be filled in and transmitted together with their corresponding data transmissions."]
[null,null,"Table 2 - Material breakdown collects data according to Article 11(2) of Directive 2008/98/EC on waste and Annex V of Implementing Decision 2019/1004, which became mandatory from the reference year 2020.\nTable 3 - Recycling rate is only to be used if a Member State wants to prove compliance with the target under point (a) of Article 11(2) of Directive 2008/98/EC until the reference year 2025\n",null,null,null,null,null,null,null,null,null," "]
[null,null,"Before filling in the questionnaire please read carefully the instructions below. This EXCEL workbook is the questionnaire. Please do not  delete or add rows in the questionnaire (except where instructed in the quality report tab)."]
{"$rows_left_out":80}
{"sheet":"Methodology","index":3,"n_rows":30,"n_cols":6,"rows_kept":30,"cut":false,"hidden":false,"merged":[[9,2,9,5],[3,2,3,5],[4,2,4,5],[6,2,6,5],[7,2,7,5],[8,2,8,5],[25,2,25,5],[26,2,26,5],[28,2,28,5],[29,2,29,5],[13,2,13,5],[14,2,14,5],[16,2,16,5],[21,2,21,5]]}
[]
[]
[null,null,null,null,null,{"$f":"UPPER(Lists!K3)","v":"STATISTICAL OFFICE OF THE EUROPEAN UNION"}]
[null,null,{"$f":"UPPER(Lists!K7)","v":"MUNICIPAL WASTE REPORTING OBLIGATIONS"}]
[null,null,{"$f":"CONCATENATE(Lists!K8,\" DATA COLLECTION\")","v":"2026 DATA COLLECTION"}]
[]
[null,null,"METHODOLOGY AND LEGAL ACTS"]
[null,null,"Table of contents"]
[null,null,"1. Background"]
[null,null,"2. Legal acts"]
{"$rows_left_out":21}
{"sheet":"GETTING STARTED","index":4,"n_rows":25,"n_cols":7,"rows_kept":25,"cut":false,"hidden":false,"merged":[[24,2,24,6],[3,2,3,6],[4,2,4,6],[6,2,6,6],[13,3,13,6],[15,3,15,6],[17,3,17,6],[19,3,19,6],[21,3,21,6]]}
[]
[]
[null,null,null,null,null,null,{"$f":"UPPER(Lists!K3)","v":"STATISTICAL OFFICE OF THE EUROPEAN UNION"}]
[null,null,{"$f":"UPPER(Lists!K7)","v":"MUNICIPAL WASTE REPORTING OBLIGATIONS"}]
[null,null,{"$f":"CONCATENATE(Lists!K8,\" DATA COLLECTION\")","v":"2026 DATA COLLECTION"}]
[]
[null,null," GETTING STARTED"]
[]
[null,null,"Please select your country (click on the white cell):    ",null,"Finland",null,""]
[null,null,"Reference year:    ",null,2024]
{"$rows_left_out":16}
{"sheet":"Footnotes list","index":5,"n_rows":58,"n_cols":5,"rows_kept":58,"cut":false,"hidden":false,"merged":[[1,3,1,4],[3,3,3,4],[4,3,4,4],[6,3,6,4],[7,3,7,4]]}
[]
[]
[null,null,null,null,{"$f":"UPPER(Lists!K3)","v":"STATISTICAL OFFICE OF THE EUROPEAN UNION"}]
[null,null,null,{"$f":"UPPER(Lists!K7)","v":"MUNICIPAL WASTE REPORTING OBLIGATIONS"}]
[null,null,null,{"$f":"CONCATENATE(Lists!K8,\" DATA COLLECTION\")","v":"2026 DATA COLLECTION"}]
[]
[null,null,null,"EXPLANATORY FOOTNOTES"]
[null,null,null,{"$f":"IF('GETTING STARTED'!E9=\"\",\"\",'GETTING STARTED'!E9)","v":"Finland"}]
[null,null,null,1,"INCLUDES: 160107*, 191210, 200202"]
[null,null,null,2,"\"W091_092_MUN\" included in \"MUN_OTH\" due to confidentiality reasons. "]
{"$rows_left_out":49}
{"sheet":"Table 2 - Material breakdown","index":6,"n_rows":37,"n_cols":31,"rows_kept":37,"cut":false,"hidden":false,"merged":[[36,5,36,18],[34,5,34,18],[30,5,30,30],[29,5,29,30],[4,9,4,10],[4,13,4,14],[4,17,4,18],[4,21,4,22],[4,25,4,26],[4,29,4,30],[2,4,2,5],[3,4,3,5],[1,4,1,30],[35,5,35,18],[4,1,4,2],[2,6,2,30],[3,6,3,30]]}
[]
[null,null,null,null,"Table 2 - material breakdown according to Implementing Decision 2019/1004/EC Annex V"]
[null,null,null,null,"Country:",null,{"$f":"IF('GETTING STARTED'!E9=\"\",\"\",VLOOKUP('GETTING STARTED'!E9,Lists!A2:B40,2,FALSE))","v":"FI"}]
[null,null,null,null,"Reference year: ",null,{"$f":"IF('GETTING STARTED'!E10=\"\",\"\",'GETTING STARTED'!E10)","v":2024}]
[null,"TO HIDE",null,null,"Codes","Municipal waste","List of Waste codes (LoW) (for generated amounts only)","Municipal waste generated (tonnes)(1) ","Standard footnotes","Explanatory\nfootnote",null,"Separate collection(8) (tonnes)","Standard footnotes","Explanatory\nfootnote",null,"Preparing for reuse (tonnes)","Standard footnotes","Explanatory\nfootnote",null,"Recycling (tonnes)","Standard footnotes","Explanatory\nfootnote",null,"Energy recovery (tonnes)(2) ","Standard footnotes","Explanatory\nfootnote",null,"Other recovery (tonnes)(3) ","Standard footnotes","Explanatory\nfootnote"]
[null,"Source","unit",null,null,null,null,"GEN",null,null,null,"COL_SEP",null,null,null,"PRP_REU",null,null,null,"RCY",null,null,null,"RCV_E",null,null,null,"RCV_OTH"]
[null,"ANNEX_V","T",null,"TOTAL","Total",null,2519645,null,null,{"$f":"IF(TRIM(J7)=\"\", \"\", IF(VLOOKUP(J7,'Footnotes list'!$D$9:$E$58,2,FALSE)=0,\"\",VLOOKUP(J7,'Footnotes list'!$D$9:$E$58,2,FALSE) ) )","v":""},null,null,null,{"$f":"IF(TRIM(N7)=\"\", \"\", IF(VLOOKUP(N7,'Footnotes list'!$D$9:$E$58,2,FALSE)=0,\"\",VLOOKUP(N7,'Footnotes list'!$D$9:$E$58,2,FALSE) ) )","v":""},7476,null,null,{"$f":"IF(TRIM(R7)=\"\", \"\", IF(VLOOKUP(R7,'Footnotes list'!$D$9:$E$58,2,FALSE)=0,\"\",VLOOKUP(R7,'Footnotes list'!$D$9:$E$58,2,FALSE) ) )","v":""},1208749,null,3,{"$f":"IF(TRIM(V7)=\"\", \"\", IF(VLOOKUP(V7,'Footnotes list'!$D$9:$E$58,2,FALSE)=0,\"\",VLOOKUP(V7,'Footnotes list'!$D$9:$E$58,2,FALSE) ) )","v":"The validation does not take into account the black cells (for error logs 2 and 3). Needed to add more \"other waste\" in order to validate the questionnaire"},1281916,null,3,{"$f":"IF(TRIM(Z7)=\"\", \"\", IF(VLOOKUP(Z7,'Footnotes list'!$D$9:$E$58,2,FALSE)=0,\"\",VLOOKUP(Z7,'Footnotes list'!$D$9:$E$58,2,FALSE) ) )","v":"The validation does not take into account the black cells (for error logs 2 and 3). Needed to add more \"other waste\" in order to validate the questionnaire"},4420,null,null,{"$f":"IF(TRIM(AD7)=\"\", \"\", IF(VLOOKUP(AD7,'Footnotes list'!$D$9:$E$58,2,FALSE)=0,\"\",VLOOKUP(AD7,'Footnotes list'!$D$9:$E$58,2,FALSE) ) )","v":""}]
[null,"ANNEX_V","T",null,"W063_122_MUN","Metals","20 01 40, 15 01 04, 15 01 11*    ",48814,null,null,{"$f":"IF(TRIM(J8)=\"\", \"\", IF(VLOOKUP(J8,'Footnotes list'!$D$9:$E$58,2,FALSE)=0,\"\",VLOOKUP(J8,'Footnotes list'!$D$9:$E$58,2,FALSE) ) )","v":""},null,null,null,{"$f":"IF(TRIM(N8)=\"\", \"\", IF(VLOOKUP(N8,'Footnotes list'!$D$9:$E$58,2,FALSE)=0,\"\",VLOOKUP(N8,'Footnotes list'!$D$9:$E$58,2,FALSE) ) )","v":""},null,null,null,{"$f":"IF(TRIM(R8)=\"\", \"\", IF(VLOOKUP(R8,'Footnotes list'!$D$9:$E$58,2,FALSE)=0,\"\",VLOOKUP(R8,'Footnotes list'!$D$9:$E$58,2,FALSE) ) )","v":""},48803,null,null,{"$f":"IF(TRIM(V8)=\"\", \"\", IF(VLOOKUP(V8,'Footnotes list'!$D$9:$E$58,2,FALSE)=0,\"\",VLOOKUP(V8,'Footnotes list'!$D$9:$E$58,2,FALSE) ) )","v":""},null,null,null,{"$f":"IF(TRIM(Z8)=\"\", \"\", IF(VLOOKUP(Z8,'Footnotes list'!$D$9:$E$58,2,FALSE)=0,\"\",VLOOKUP(Z8,'Footnotes list'!$D$9:$E$58,2,FALSE) ) )","v":""},null,null,null,{"$f":"IF(TRIM(AD8)=\"\", \"\", IF(VLOOKUP(AD8,'Footnotes list'!$D$9:$E$58,2,FALSE)=0,\"\",VLOOKUP(AD8,'Footnotes list'!$D$9:$E$58,2,FALSE) ) )","v":""}]
[null,"ANNEX_V","T",null,"W063_122_MUN_INC","Metals separated after incineration of waste(4) ","20 01 40, 15 01 04, 15 01 11*    ",null,null,null,null,null,null,null,null,null,null,null,null,null,null,null,{"$f":"IF(TRIM(V9)=\"\", \"\", IF(VLOOKUP(V9,'Footnotes list'!$D$9:$E$58,2,FALSE)=0,\"\",VLOOKUP(V9,'Footnotes list'!$D$9:$E$58,2,FALSE) ) )","v":""}]
[null,"ANNEX_V","T",null,"W071_MUN","Glass","20 01 02, 15 01 07 ",101747,null,null,{"$f":"IF(TRIM(J10)=\"\", \"\", IF(VLOOKUP(J10,'Footnotes list'!$D$9:$E$58,2,FALSE)=0,\"\",VLOOKUP(J10,'Footnotes list'!$D$9:$E$58,2,FALSE) ) )","v":""},null,null,null,{"$f":"IF(TRIM(N10)=\"\", \"\", IF(VLOOKUP(N10,'Footnotes list'!$D$9:$E$58,2,FALSE)=0,\"\",VLOOKUP(N10,'Footnotes list'!$D$9:$E$58,2,FALSE) ) )","v":""},null,null,null,{"$f":"IF(TRIM(R10)=\"\", \"\", IF(VLOOKUP(R10,'Footnotes list'!$D$9:$E$58,2,FALSE)=0,\"\",VLOOKUP(R10,'Footnotes list'!$D$9:$E$58,2,FALSE) ) )","v":""},101135,null,null,{"$f":"IF(TRIM(V10)=\"\", \"\", IF(VLOOKUP(V10,'Footnotes list'!$D$9:$E$58,2,FALSE)=0,\"\",VLOOKUP(V10,'Footnotes list'!$D$9:$E$58,2,FALSE) ) )","v":""},null,null,null,null,552]
{"$rows_left_out":28}
{"sheet":"Table 3 - Recycling rate","index":7,"n_rows":12,"n_cols":13,"rows_kept":12,"cut":false,"hidden":false,"merged":[[5,1,5,3],[10,4,10,15],[11,4,11,15],[12,4,12,15],[1,4,1,12],[2,5,2,12],[3,5,3,12],[4,6,4,12],[5,6,6,6],[5,7,6,8],[5,10,6,10],[5,11,6,12]]}
[]
[null,null,null,null,"Table 3 - Recycling rate for measuring compliance with the policy target according to point (a) of Article 11(2) of Directive 2008/98/EC, according to the format set out in Annex IV of the Commission Implementing Decisions 2019/1004 - to be filled in only by the Member States wanting to prove compliance with the old targets until 2025 using the old rules"]
[null,null,null,null,"Country:",{"$f":"IF('GETTING STARTED'!E9=\"\",\"\",VLOOKUP('GETTING STARTED'!E9,Lists!A2:B40,2,FALSE))","v":"FI"}]
[null,null,null,null,"Reference year:",{"$f":"IF('GETTING STARTED'!E10=\"\",\"\",'GETTING STARTED'!E10)","v":2024}]
[null,null,null,null,"Calculation method(1) ",2,{"$f":"IF(F5=\"\",\" <= Select the calculation method here\",VLOOKUP(F5,'Lists (specific)'!A2:B6,2,FALSE))","v":"Preparation for reuse and recycling of paper, metal, plastic, glass household waste and other single types of household waste or similar waste "}]
[null,"TO HIDE",null,null,null,"Municipal waste generated (2) ","Standard footnotes","Explanatory footnote",null,"Preparing for re-use and recycling(2)","Standard footnotes","Explanatory footnote"]
[null,"Source","waste","unit",null,"GEN",null,null,null,"RCY_PRP_REU"]
[null,"ANNEX_IV","TOTAL","T","Tonnes",2045365,null,null,{"$f":"IF(TRIM(H8)=\"\", \"\", IF(VLOOKUP(H8,'Footnotes list'!$D$9:$E$58,2,FALSE)=0,\"\",VLOOKUP(H8,'Footnotes list'!$D$9:$E$58,2,FALSE) ) )","v":""},1141488,null,null,{"$f":"IF(TRIM(L8)=\"\", \"\", IF(VLOOKUP(L8,'Footnotes list'!$D$9:$E$58,2,FALSE)=0,\"\",VLOOKUP(L8,'Footnotes list'!$D$9:$E$58,2,FALSE) ) )","v":""}]
[]
[null,null,null,null,"Notes:"]
{"$rows_left_out":3}
{"sheet":"QR Table 2 - Material-breakdown","index":8,"n_rows":237,"n_cols":8,"rows_kept":237,"cut":false,"hidden":false,"merged":[[17,0,17,1],[17,2,17,3],[18,0,18,1],[18,2,18,3],[221,0,221,11],[223,0,223,11],[224,0,224,11],[202,0,202,11],[222,0,222,11],[204,1,204,4],[193,0,193,11],[196,0,196,11],[200,0,200,11],[201,0,201,11],[203,0,203,11],[204,8,218,11],[188,0,188,11],[189,0,189,11],[191,0,191,11],[192,0,192,11],[194,0,194,11],[195,0,195,11],[197,0,197,11],[198,0,198,1],[235,0,235,11],[237,0,237,11],[226,0,226,11],[227,0,227,11],[229,0,229,11],[219,0,219,11],[230,8,231,11],[232,0,232,11],[233,0,233,11],[225,0,225,11],[228,0,228,11],[220,0,220,10],[234,0,234,11],[236,0,236,11],[198,2,198,3],[198,4,198,5],[198,6,199,11],[199,0,199,1],[199,2,199,3],[199,4,199,5],[181,0,181,11],[182,0,182,11],[183,0,183,11],[184,0,184,11],[185,0,185,11],[178,0,178,11],[186,0,186,11],[187,0,187,11],[190,0,190,11],[171,0,171,11],[172,0,172,11],[173,0,173,11],[174,0,174,11],[175,0,175,11],[176,0,176,11],[177,0,177,11],[179,0,179,11],[180,0,180,11],[161,0,161,11],[160,0,160,11],[155,0,155,11],[157,0,157,11],[158,0,158,1],[158,2,158,3],[158,4,158,5],[158,6,158,7],[152,0,152,1],[152,2,152,3],[167,0,167,11],[168,0,168,11],[169,0,169,11],[170,0,170,11],[166,0,166,11],[165,0,165,11],[164,0,164,11],[163,0,163,11],[162,0,162,11],[150,0,150,11],[151,0,151,1],[151,2,151,3],[151,4,151,5],[135,0,135,11],[134,0,134,11],[152,6,152,7],[159,0,159,1],[159,2,159,3],[159,4,159,5],[159,6,159,7],[152,4,152,5],[156,0,156,11],[153,0,153,11],[154,0,154,11],[143,0,143,11],[141,0,141,11],[139,0,139,11],[138,0,138,11],[136,0,136,11],[144,6,145,11],[142,0,142,11],[149,0,149,11],[151,6,151,7],[20,0,20,11],[21,0,21,11],[67,0,67,11],[69,0,69,11],[70,0,70,11],[93,0,93,11],[85,0,85,11],[84,0,84,11],[96,8,109,11],[78,0,78,11],[80,0,80,11],[88,0,88,11],[95,0,95,11],[92,0,92,11],[77,0,77,11],[81,0,81,11],[82,0,82,11],[86,0,86,1],[86,2,86,3],[86,4,86,5],[87,0,87,1],[87,2,87,3],[87,4,87,5],[83,0,83,11],[10,0,10,4],[5,0,5,4],[5,5,5,11],[6,0,6,4],[6,5,6,11],[10,5,10,11],[11,0,11,4],[11,5,11,11],[15,0,15,11],[0,0,0,11],[16,0,16,1],[16,2,16,3],[19,0,19,1],[19,2,19,3],[47,0,47,11],[48,0,48,11],[49,0,49,11],[22,0,22,11],[23,0,23,10],[24,0,24,11],[28,8,44,11],[3,0,3,10],[4,0,4,4],[4,5,4,11],[12,0,12,11],[13,0,13,10],[14,0,14,11],[7,0,7,4],[7,5,7,11],[8,0,8,4],[8,5,8,11],[9,0,9,4],[9,5,9,11],[25,0,25,11],[27,0,27,11],[45,0,45,11],[46,0,46,11],[73,0,73,11],[75,0,75,11],[76,0,76,11],[26,0,26,11],[72,0,72,11],[52,6,52,8],[53,6,53,8],[54,6,54,8],[56,6,56,8],[57,6,57,8],[58,6,58,8],[60,6,60,8],[62,6,62,8],[63,6,63,8],[61,6,61,8],[64,6,64,8],[59,6,59,8],[55,6,55,8],[51,3,51,8],[51,2,52,2],[147,0,147,11],[148,0,148,11],[137,0,137,11],[140,0,140,11],[144,0,144,1],[144,2,144,3],[144,4,144,5],[145,0,145,1],[145,2,145,3],[145,4,145,5],[146,0,146,11],[133,1,133,2],[132,1,132,2],[131,1,131,2],[130,1,130,2],[123,1,123,2],[120,1,120,2],[119,0,119,11],[118,0,118,11],[117,0,117,11],[120,3,133,11],[121,1,121,2],[122,1,122,2],[116,0,116,11],[115,0,115,11],[124,1,124,2],[125,1,125,2],[126,1,126,2],[127,1,127,2],[128,1,128,2],[129,1,129,2],[68,0,68,11],[51,1,52,1],[51,0,52,0],[79,0,79,11],[114,0,114,11],[113,0,113,11],[112,0,112,11],[111,0,111,11],[110,0,110,11],[94,0,94,11],[91,0,91,11],[90,0,90,11],[89,0,89,11],[71,0,71,11],[74,0,74,11]]}
["Municipal Waste\nQuality report - Table 2 - Material breakdown"]
[null,null," "]
[]
["1. General information"]
["1.1. Member State",null,null,null,null,"Finland"]
["1.2. Organisation submitting the data and the description"," ",null,null,null,"Finnish Environment Institute"]
["1.3. Contact name"," ",null,null,null,"Heidi Pirtonen"]
["1.4. Contact email address"," ",null,null,null,"jateraportoinnit@syke.fi"]
["1.5. Contact phone number"," "]
["1.6. Reference year"," ",null,null,null,2024]
{"$rows_left_out":228}
{"sheet":"QR Table 3 - Recycling rate","index":9,"n_rows":60,"n_cols":7,"rows_kept":60,"cut":false,"hidden":false,"merged":[[0,0,0,11],[56,0,56,11],[58,0,58,11],[60,0,60,11],[36,0,36,11],[54,0,54,11],[51,0,51,11],[55,0,55,11],[57,0,57,11],[46,0,46,11],[37,0,37,11],[38,0,38,11],[42,0,42,11],[45,0,45,11],[39,0,39,11],[40,0,40,11],[43,0,43,11],[44,0,44,11],[59,0,59,11],[47,0,47,11],[48,0,48,11],[49,0,49,11],[50,0,50,11],[52,0,52,11],[53,0,53,11],[13,0,13,11],[14,0,14,11],[12,0,12,11],[16,0,16,11],[21,0,22,0],[21,1,22,1],[15,0,15,11],[18,0,18,11],[17,0,17,11],[19,0,19,11],[21,2,21,6],[20,0,20,11],[21,7,35,11],[9,0,9,11],[10,0,10,10],[11,0,11,11],[7,0,7,4],[7,5,7,11],[8,0,8,4],[8,5,8,11],[6,0,6,4],[6,5,6,11],[3,0,3,10],[4,0,4,4],[4,5,4,11],[5,0,5,4],[5,5,5,11]]}
["Municipal Waste\nQuality report - Table 3 - Recycling rate for 2020 target if not using method 4"]
[]
[null,null," "]
["1. General information"]
["1.1. Member State",null,null,null,null,"Finland"]
["1.1. Organisation submitting the data and the description"," ",null,null,null,"Finnish Environment Institute"]
["1.3. Contact person/contact details"," ",null,null,null,"Heidi Pirtonen / jateraportoinnit@syke.fi"]
["1.4. Reference year"," ",null,null,null,2024]
["1.5. Delivery date / version"," ",null,null,null,"2026-07-07"]
[]
{"$rows_left_out":51}
{"sheet":"ErrorLog","index":10,"n_rows":3,"n_cols":7,"rows_kept":3,"cut":false,"hidden":false,"merged":[]}
["Link to Error","Validation Rule","Cell","Sheet","Description","Severity","Former Color"]
["Go to cell","Summations","H14","Table 2 - Material breakdown","Total Generated should be greater than PRP_REU + RCY + RCV_E + RCV_OTH","Error",16777215]
["Go to cell","Summations","H19","Table 2 - Material breakdown","Total Generated should be greater than PRP_REU + RCY + RCV_E + RCV_OTH","Error",16777215]

{"sheet":"IsNumeric","index":11,"n_rows":3,"n_cols":9,"rows_kept":3,"cut":false,"hidden":true,"merged":[]}
["Severity","SheetName","TopLeftCell","BottomRightCell","RowStep","ColumnStep"]
["Error","Table 2 - Material breakdown","H7","AB21",1,4,null,null,"it is meant to check that there are numerical values"]
["Error","Table 3 - Recycling rate","F8","J8",999,4]

{"sheet":"FootnoteContent","index":12,"n_rows":3,"n_cols":7,"rows_kept":3,"cut":false,"hidden":true,"merged":[]}
["Severity","SheetName","TopLeftCell","BottomRightCell","RowStep","ColumnStep","DistanceFromReferenceToText"]
["Error","Table 2 - Material breakdown","J7","AD21",1,4,1]
["Error","Table 3 - Recycling rate","H8","L8",999,4,1]

{"sheet":"Mandatory","index":13,"n_rows":16,"n_cols":9,"rows_kept":16,"cut":false,"hidden":true,"merged":[]}
["Severity","SheetName","Top Left Cell","Bottom Right Cell","Row Step","Column Step","Empty Is Valid If Footnote Exists","Footnote Shift From Value"]
["Error","GETTING STARTED","E9","E10",1,999,"NO",999,"STANDARD FOR ALL QUESTIONNAIRES"]
["Error","GETTING STARTED","D14","D22",2,999,"NO",999]
["Error","Table 2 - Material breakdown","H7","H8",1,999,"YES",3]
["Error","Table 2 - Material breakdown","H10","H19",1,999,"YES",3]
["Error","Table 2 - Material breakdown","H21","H21",999,999,"YES",3]
["Error","Table 2 - Material breakdown","P7","P7",999,999,"YES",3]
["Error","Table 2 - Material breakdown","T7","T8",1,999,"YES",3]
["Error","Table 2 - Material breakdown","T10","T19",1,999,"YES",3]
["Error","Table 2 - Material breakdown","T21","T21",999,999,"YES",3]
{"$rows_left_out":7}
{"sheet":"MustNotBeNegative","index":14,"n_rows":3,"n_cols":6,"rows_kept":3,"cut":false,"hidden":true,"merged":[]}
["Severity","SheetName","TopLeftCell","BottomRightCell","RowStep","ColumnStep"]
["Error","Table 2 - Material breakdown","H7","AB21",1,4]
["Error","Table 3 - Recycling rate","F8","J8",999,4]

{"sheet":"Changelog","index":15,"n_rows":5,"n_cols":7,"rows_kept":5,"cut":false,"hidden":true,"merged":[]}
["Change","Changed by","SheetName","Cell","Version","Date","REMARKS"]
["Add macros version m01b","CDD","VB",null,"v00m01b","2024-03-20"]
["Add macro \"Workbook_SheetChange\" in \"ThisWorkbook\"","CDD","VB",null,"v00m01b","2024-03-20"]
["Add sheet \"MacroBehaviour\"","CDD","MacroBehaviour",null,"v00m01b","2024-03-20"]
["Add sheet \"Lists (specific)\"","CDD","Lists (specific)",null,"v00m01b","2024-03-20"]

{"sheet":"Summations","index":16,"n_rows":113,"n_cols":13,"rows_kept":113,"cut":false,"hidden":true,"merged":[[14,5,14,6]]}
["Severity","Sheet Name","List of Cells\n (first block)","First Total Cell (first block)","Last Total Cell\n(Last block)","Row Block Repetition Step","Column Block Repetition Step","Greater or Equal","Valid Tolerance","Only if all data is available","Non compliance Is Valid If Footnote Exists","Footnote Shift From Value","Display text in error"]
["Error","Table 2 - Material breakdown","H8,H9,H10,H11,H12,H13,H14,H15,H16,H17,H18,H19,H20,H21","H7","AB7",999,4,"EQ",0.1,"NO","NO",3,"Total waste not consistent to the sum of materials"]
["Error","Table 2 - Material breakdown","P7,T7,X7,AB7","H7","H21",1,999,"GT",0,"NO","NO",3,"Total Generated should be greater than PRP_REU + RCY + RCV_E + RCV_OTH"]
["Error","Table 2 - Material breakdown","H20","H7","H7",999,999,"GT",0,"YES","NO",3,"Total Generated 'Mixed Waste' should be less than than the 'Total Generated Waste'  "]
["Error","Table 3 - Recycling rate","J8","F8","F8",999,999,"GT",0,"YES","NO",3,"Total Generated should be greater than RCY_PRP_REU"]
[]
[]
[]
[]
[]
{"$rows_left_out":104}
{"sheet":"Lists","index":17,"n_rows":40,"n_cols":13,"rows_kept":40,"cut":false,"hidden":true,"merged":[[1,9,1,10],[5,9,5,10],[10,9,10,10],[15,9,15,10]]}
["Country label","Country code",null,"Valid flags\n(obs_status)","Label",null,"Valid flags\n(obs_conf)","Label",null,"Textual variables","String",null,"WASTE-2026-DC"]
["Belgium","BE",null,"B","Break in time series",null,null,null,null,"Institutional names"]
["Bulgaria","BG",null,"E","Estimated data",null,null,null,null,"Eurostat Text","Statistical Office of the European Union"]
["Czechia","CZ",null,"P","Provisional",null,null,null,null,"Directorate Text","Directorate E: Sectoral and regional statistics"]
["Denmark","DK",null,"BE","Break in time series, estimated",null,null,null,null,"Unit Text","Unit E-2: Environmental statistics and accounts; sustainable development"]
["Germany","DE",null,"BP","Break in time series, provisional",null,null,null,null,"Data collection information"]
["Estonia","EE",null,"EP","Estimated, provisional",null,null,null,null,"Data Collection Text","Municipal waste reporting obligations"]
["Ireland","IE",null,"BEP","Break in time series, estimated, provisional",null,null,null,null,"Data Collection Year",2026]
["Greece","EL",null,null,null,null,null,null,null,"Launching date","27 May 2026"]
["Spain","ES",null,null,null,null,null,null,null,"Submission deadline","30 June 2026"]
{"$rows_left_out":31}
{"sheet":"Lists (specific)","index":18,"n_rows":6,"n_cols":2,"rows_kept":6,"cut":false,"hidden":true,"merged":[]}
["Calculation method label","Calculation method code"]
[null,"<= Select the calculation method here"]
[1,"Preparation for reuse and recycling of paper, metal, plastic and glass household waste "]
[2,"Preparation for reuse and recycling of paper, metal, plastic, glass household waste and other single types of household waste or similar waste "]
[3,"Preparation for reuse and recycling of household waste "]
[4,"Preparation for reuse and recycling of municipal waste "]

{"sheet":"MacroBehaviour","index":19,"n_rows":3,"n_cols":7,"rows_kept":3,"cut":false,"hidden":true,"merged":[[0,0,0,2],[0,4,0,6]]}
["COMMON TO ALL (OR MOST)  QUESTIONNAIRE",null,null,null,"SPECIFIC TO THIS QUESTIONNAIRE"]
["Parameter","Value","(Valid values)",null,"Parameter","Value","(Valid values)"]
["DevelopementMode",false,"TRUE (during development)\nFALSE (For real reporting and testing)"]