{"text_format":"1","workbook":"xlsx","n_sheets":24,"sheets":["Cover","Index","Basic Instructions","Methodology","Reference values","Validation rules","GETTING STARTED","Footnotes list","Table 1","Table 2","Table 3","Quality Report","ErrorLog","Changelog","Lists","Locks","IsFormula","Summations","Mandatory","MandatoryAtLeast","ForbiddenStrings","FootnoteContent","MustNotBeNegative","IsNumeric"],"not_rendered":{"charts":0,"images":5,"macros":1,"external_links":0,"defined_names":23,"comments":0,"pivot_tables":0},"unopened":[],"bounds":{"document_bytes":16777216,"sheet_cells":100000,"rows_first":2000,"rows_last":500,"rows_between":2000,"halvings":0,"cell_chars":16384,"cell_head_chars":4096},"cells_cut":0,"cells_raw":0,"read":"whole","date_system":"1900"}

{"sheet":"Cover","index":0,"n_rows":9,"n_cols":3,"rows_kept":9,"cut":false,"hidden":false,"merged":[[18,1,23,3]]}
[]
[]
[null,null,{"$f":"UPPER(Lists!K3)","v":"STATISTICAL OFFICE OF THE EUROPEAN UNION"}]
[]
[null,null,{"$f":"Lists!K4","v":"Directorate E: Sectoral and regional statistics"}]
[null,null,{"$f":"Lists!K5","v":"Unit E-2: Environmental statistics and accounts; sustainable development"}]
{"$rows_left_out":4}
{"sheet":"Index","index":1,"n_rows":27,"n_cols":5,"rows_kept":27,"cut":false,"hidden":false,"merged":[[21,2,21,4],[24,2,24,4],[1,2,1,4],[3,2,3,4],[4,2,4,4],[6,2,6,4],[8,2,8,4],[14,2,14,4]]}
[]
[]
[null,null,null,null,{"$f":"UPPER(Lists!K3)","v":"STATISTICAL OFFICE OF THE EUROPEAN UNION"}]
[null,null,{"$f":"UPPER(Lists!K7)","v":"ANNUAL REPORTING OF MINERAL AND SYNTHETIC LUBRICATION AND INDUSTRIAL OILS AND WASTE OILS"}]
[null,null,{"$f":"CONCATENATE(Lists!K8,\" DATA COLLECTION\")","v":"2022 DATA COLLECTION"}]
[]
{"$rows_left_out":22}
{"sheet":"Basic Instructions","index":2,"n_rows":94,"n_cols":6,"rows_kept":94,"cut":false,"hidden":false,"merged":[[91,2,91,5],[10,2,10,5],[11,2,11,5],[12,2,12,5],[13,2,13,5],[14,2,14,5],[67,2,67,5],[47,2,47,5],[49,2,49,5],[51,2,51,5],[53,2,53,5],[55,2,55,5],[56,2,56,5],[57,2,57,5],[60,2,60,5],[18,2,18,5],[9,2,9,5],[3,2,3,5],[4,2,4,5],[6,2,6,5],[7,2,7,5],[8,2,8,5],[35,2,35,5],[16,2,16,5],[19,2,19,5],[21,2,21,5],[25,2,25,5],[33,2,33,5],[88,2,88,5],[89,2,89,5],[93,2,93,5],[84,2,84,5],[68,2,68,5],[70,2,70,5],[72,2,72,5],[74,2,74,5],[75,2,75,5],[77,2,77,5],[78,2,78,5],[79,2,79,5],[81,2,81,5],[83,2,83,5],[90,2,90,5],[92,2,92,5],[59,2,59,5],[66,2,66,5],[85,2,85,5],[86,2,86,5],[87,2,87,5]]}
[]
[]
[null,null,null,null,null,{"$f":"UPPER(Lists!K3)","v":"STATISTICAL OFFICE OF THE EUROPEAN UNION"}]
[null,null,{"$f":"UPPER(Lists!K7)","v":"ANNUAL REPORTING OF MINERAL AND SYNTHETIC LUBRICATION AND INDUSTRIAL OILS AND WASTE OILS"}]
[null,null,{"$f":"CONCATENATE(Lists!K8,\" DATA COLLECTION\")","v":"2022 DATA COLLECTION"}]
[]
{"$rows_left_out":89}
{"sheet":"Methodology","index":3,"n_rows":26,"n_cols":6,"rows_kept":26,"cut":false,"hidden":false,"merged":[[9,2,9,5],[3,2,3,5],[4,2,4,5],[6,2,6,5],[7,2,7,5],[8,2,8,5],[23,2,23,5],[24,2,24,5],[25,2,25,5],[13,2,13,5],[14,2,14,5],[15,2,15,5],[17,2,17,5],[21,2,21,5],[22,2,22,5]]}
[]
[]
[null,null,null,null,null,{"$f":"UPPER(Lists!K3)","v":"STATISTICAL OFFICE OF THE EUROPEAN UNION"}]
[null,null,{"$f":"UPPER(Lists!K7)","v":"ANNUAL REPORTING OF MINERAL AND SYNTHETIC LUBRICATION AND INDUSTRIAL OILS AND WASTE OILS"}]
[null,null,{"$f":"CONCATENATE(Lists!K8,\" DATA COLLECTION\")","v":"2022 DATA COLLECTION"}]
[]
{"$rows_left_out":21}
{"sheet":"Reference values","index":4,"n_rows":22,"n_cols":3,"rows_kept":22,"cut":false,"hidden":false,"merged":[[1,1,1,2],[4,1,5,1],[6,1,6,2],[9,1,9,2],[21,1,21,2]]}
[]
[null,"Reference values for the calculation of generated waste oil"]
[null,"Country:",{"$f":"IF('GETTING STARTED'!E9=\"\",\"\",VLOOKUP('GETTING STARTED'!E9,Lists!A2:B40,2,FALSE))","v":"FI"}]
[null,"Reference year:",{"$f":"IF('GETTING STARTED'!E10=\"\",\"\",'GETTING STARTED'!E10)","v":2021}]
[null,null,1]
[null,null,"Fraction of oils placed on market (%)"]
{"$rows_left_out":17}
{"sheet":"Validation rules","index":5,"n_rows":52,"n_cols":6,"rows_kept":52,"cut":false,"hidden":false,"merged":[[10,2,10,5],[3,2,3,5],[4,2,4,5],[6,2,6,5],[8,2,8,5],[9,2,9,5],[24,2,24,5],[11,3,11,5],[12,3,12,5],[13,2,13,5],[14,2,14,5],[15,3,15,5],[16,3,16,5],[17,2,17,5],[18,2,18,5],[19,2,19,5],[20,2,20,5],[21,2,21,5],[39,3,39,5],[26,2,26,5],[27,2,27,5],[28,2,28,5],[30,2,30,5],[32,2,32,5],[33,2,33,5],[34,3,34,5],[35,3,35,5],[36,3,36,5],[37,2,37,5],[38,3,38,5],[46,3,46,5],[48,2,48,5],[50,2,50,5],[51,2,51,5],[40,3,40,5],[41,2,41,5],[42,3,42,5],[43,2,43,5],[44,3,44,5],[45,3,45,5]]}
[]
[]
[null,null,null,null,null,{"$f":"UPPER(Lists!K3)","v":"STATISTICAL OFFICE OF THE EUROPEAN UNION"}]
[null,null,{"$f":"UPPER(Lists!K7)","v":"ANNUAL REPORTING OF MINERAL AND SYNTHETIC LUBRICATION AND INDUSTRIAL OILS AND WASTE OILS"}]
[null,null,{"$f":"CONCATENATE(Lists!K8,\" DATA COLLECTION\")","v":"2022 DATA COLLECTION"}]
[]
{"$rows_left_out":47}
{"sheet":"GETTING STARTED","index":6,"n_rows":25,"n_cols":7,"rows_kept":25,"cut":false,"hidden":false,"merged":[[3,2,3,6],[4,2,4,6],[6,2,6,6],[24,2,24,6],[13,3,13,6],[15,3,15,6],[17,3,17,6],[19,3,19,6],[21,3,21,6]]}
[]
[]
[null,null,null,null,null,null,"STATISTICAL OFFICE OF THE EUROPEAN UNION"]
[null,null,{"$f":"Lists!K7","v":"Annual reporting of Mineral and Synthetic Lubrication and Industrial Oils and Waste Oils"}]
[null,null,{"$f":"CONCATENATE(Lists!K8,\" DATA COLLECTION\")","v":"2022 DATA COLLECTION"}]
[]
{"$rows_left_out":20}
{"sheet":"Footnotes list","index":7,"n_rows":58,"n_cols":5,"rows_kept":58,"cut":false,"hidden":false,"merged":[[1,3,1,4],[3,3,3,4],[4,3,4,4],[6,3,6,4],[7,3,7,4]]}
[]
[]
[null,null,null,null,{"$f":"UPPER(Lists!K3)","v":"STATISTICAL OFFICE OF THE EUROPEAN UNION"}]
[null,null,null,{"$f":"UPPER(Lists!K7)","v":"ANNUAL REPORTING OF MINERAL AND SYNTHETIC LUBRICATION AND INDUSTRIAL OILS AND WASTE OILS"}]
[null,null,null,{"$f":"CONCATENATE(Lists!K8,\" DATA COLLECTION\")","v":"2022 DATA COLLECTION"}]
[]
{"$rows_left_out":53}
{"sheet":"Table 1","index":8,"n_rows":33,"n_cols":71,"rows_kept":33,"cut":false,"hidden":false,"merged":[[11,54,11,57],[11,58,11,61],[11,62,11,65],[6,60,6,61],[6,68,6,69],[11,66,11,69],[1,70,3,70],[11,6,11,9],[11,10,11,13],[11,14,11,17],[11,18,11,21],[11,22,11,25],[11,26,11,29],[11,30,11,33],[11,34,11,37],[11,38,11,41],[11,42,11,45],[11,46,11,49],[11,50,11,53],[6,8,6,9],[6,12,6,13],[6,20,6,21],[6,28,6,29],[6,36,6,37],[6,16,6,17],[6,24,6,25],[6,32,6,33],[6,40,6,41],[6,48,6,49],[6,56,6,57],[6,64,6,65],[4,10,4,13],[4,14,4,21],[4,22,4,29],[4,30,4,37],[4,38,4,45],[5,30,5,37],[5,38,5,45],[5,46,5,53],[5,54,5,61],[5,62,5,69],[6,44,6,45],[6,52,6,53],[7,4,7,5],[8,4,8,5],[9,4,9,5],[10,4,10,5],[1,4,1,69],[2,6,2,69],[3,6,3,69],[4,6,4,9],[4,46,4,53],[4,54,4,61],[4,62,4,69],[4,4,6,5],[5,6,5,9],[5,10,5,13],[5,14,5,21],[5,22,5,29]]}
[]
[null,null,null,null,"Table 1. Reporting on data on the placing on the market of mineral and synthetic lubrication and industrial oils and on the treatment of waste oils (in tonnes)",null,null,null,null,null,null,null,null,null,null,null,null,null,null,null,null,null,null,null,null,null,null,null,null,null,null,null,null,null,null,null,null,null,null,null,null,null,null,null,null,null,null,null,null,null,null,null,null,null,null,null,null,null,null,null,null,null,null,null,null,null,null,null,null,null,"Plausibility Warning"]
[null,null,null,null,"Country:",{"$f":"IF('GETTING STARTED'!E9=\"\",\"\",'GETTING STARTED'!E9)","v":"Finland"}]
[null,null,null,null,"Reference year: ",{"$f":"IF('GETTING STARTED'!E10=\"\",\"\",'GETTING STARTED'!E10)","v":2021}]
[null,null,null,null,null,null,1,null,null,null,2,null,null,null,3,null,null,null,null,null,null,null,4,null,null,null,null,null,null,null,5,null,null,null,null,null,null,null,6,null,null,null,null,null,null,null,7,null,null,null,null,null,null,null,8,null,null,null,null,null,null,null,9]
[null,null,null,null,null,null,"Oils placed on the market5",null,null,null,"Waste oil generated6 (dry oil)",null,null,null,"Separately collected7 waste oils ",null,null,null,null,null,null,null,"Exported8 waste oils",null,null,null,null,null,null,null,"Imported9 waste oils",null,null,null,null,null,null,null,"Regeneration10",null,null,null,null,null,null,null,"Other recycling11",null,null,null,null,null,null,null,"Energy recovery12 (R1) ",null,null,null,null,null,null,null,"Disposal13"]
{"$rows_left_out":28}
{"sheet":"Table 2","index":9,"n_rows":39,"n_cols":22,"rows_kept":39,"cut":false,"hidden":false,"merged":[[22,6,22,9],[22,10,22,13],[22,14,22,17],[5,4,6,5],[5,6,5,9],[5,10,5,13],[5,14,5,17],[7,4,7,5],[8,4,8,5],[9,4,9,5],[10,4,10,5],[11,4,11,5],[12,4,12,5],[13,4,13,5],[14,4,14,5],[15,4,15,5],[5,18,5,21],[6,8,6,9],[6,12,6,13],[6,16,6,17],[6,20,6,21],[1,4,1,21],[2,6,2,21],[3,6,3,21],[4,6,4,9],[4,10,4,13],[4,14,4,17],[4,18,4,21],[4,4,4,5],[21,4,21,5],[16,4,16,5],[17,4,17,5],[18,4,18,5],[19,4,19,5],[20,4,20,5]]}
[]
[null,null,null,null,"Table 2. Reporting on data on the treatment of waste oils (in tonnes)"]
[null,null,null,null,"Country:",{"$f":"IF('GETTING STARTED'!E9=\"\",\"\",'GETTING STARTED'!E9)","v":"Finland"}]
[null,null,null,null,"Reference year: ",{"$f":"IF('GETTING STARTED'!E10=\"\",\"\",'GETTING STARTED'!E10)","v":2021}]
[null,null,null,null,"Section                                      1",null,2,null,null,null,3,null,null,null,4,null,null,null,5]
[null,null,null,null,"Type of output from recovery",null,"Regeneration1",null,null,null,"Other recycling",null,null,null,"Energy recovery or reprocessing into materials that are to be used as fuels (including regenerated oils used as fuel) ",null,null,null,"Disposal (D10)"]
{"$rows_left_out":34}
{"sheet":"Table 3","index":10,"n_rows":19,"n_cols":62,"rows_kept":19,"cut":false,"hidden":false,"merged":[[1,5,1,61],[2,6,2,61],[3,6,3,61],[4,6,4,13],[4,14,4,21],[4,22,4,29],[4,30,4,37],[4,38,4,45],[4,46,4,53],[4,54,4,61],[5,38,5,45],[6,52,6,53],[6,60,6,61],[6,12,6,13],[6,20,6,21],[6,28,6,29],[6,36,6,37],[6,44,6,45],[5,46,5,53],[5,54,5,61],[5,6,5,13],[5,14,5,21],[5,22,5,29],[5,30,5,37],[6,8,6,9],[6,16,6,17],[6,24,6,25],[6,32,6,33],[6,40,6,41],[6,48,6,49],[6,56,6,57]]}
[]
[null,null,null,null,null,"Table 3. Reporting on data on the placing on the market of mineral and synthetic lubrication and industrial oils and treatment of waste oils other than those listed in Table 1 (in tonnes)"]
[null,null,null,null,null,"Country:",{"$f":"IF('GETTING STARTED'!E9=\"\",\"\",'GETTING STARTED'!E9)","v":"Finland"}]
[null,null,null,null,null,"Reference year:",{"$f":"IF('GETTING STARTED'!E10=\"\",\"\",'GETTING STARTED'!E10)","v":2021}]
[null,null,null,null,null,null,1,null,null,null,null,null,null,null,2,null,null,null,null,null,null,null,3,null,null,null,null,null,null,null,4,null,null,null,null,null,null,null,5,null,null,null,null,null,null,null,6,null,null,null,null,null,null,null,7]
[null,null,null,null,null,null,"Collected1 Waste Oils (t)",null,null,null,null,null,null,null,"Exported2 Waste Oils (t)",null,null,null,null,null,null,null,"Imported3 Waste Oils (t)",null,null,null,null,null,null,null,"Disposal4 (D10) (t)",null,null,null,null,null,null,null,"Regeneration (t)5",null,null,null,null,null,null,null,"Other recycling6 (t)",null,null,null,null,null,null,null,"Energy recovery(t)7"]
{"$rows_left_out":14}
{"sheet":"Quality Report","index":11,"n_rows":130,"n_cols":12,"rows_kept":130,"cut":false,"hidden":false,"merged":[[18,1,18,5],[17,6,17,12],[18,6,18,12],[14,1,14,12],[24,6,24,12],[6,7,6,12],[6,1,6,6],[1,4,1,9],[17,1,17,5],[2,4,2,9],[36,1,36,3],[30,11,31,12],[25,1,25,11],[26,1,26,12],[29,1,29,12],[19,6,19,12],[20,6,20,12],[21,6,21,12],[22,6,22,12],[23,6,23,12],[22,1,22,5],[23,1,23,5],[24,1,24,5],[19,1,19,5],[20,1,20,5],[21,1,21,5],[32,11,32,12],[33,11,33,12],[34,11,34,12],[35,11,35,12],[36,11,36,12],[42,11,42,12],[32,8,32,9],[33,8,33,9],[34,8,34,9],[35,8,35,9],[36,8,36,9],[55,1,55,12],[56,1,56,12],[48,1,48,12],[49,1,49,12],[51,1,51,12],[52,1,52,12],[54,1,54,12],[43,1,43,12],[45,1,45,12],[46,1,46,12],[40,8,40,9],[41,8,41,9],[37,1,37,3],[38,1,38,3],[39,1,39,3],[40,1,40,3],[41,1,41,3],[42,8,42,9],[53,1,53,12],[61,7,61,8],[110,1,110,12],[111,1,111,11],[112,1,112,12],[113,1,113,12],[107,1,107,11],[109,1,109,12],[90,1,90,12],[91,1,91,12],[92,1,92,12],[93,1,93,12],[62,5,62,6],[63,5,63,6],[62,2,62,3],[63,2,63,3],[60,2,60,3],[60,5,60,6],[101,6,101,12],[102,6,102,12],[103,6,103,12],[62,7,62,8],[63,7,63,8],[60,9,60,10],[39,8,39,9],[50,1,50,12],[47,1,47,12],[86,1,86,12],[83,1,83,12],[84,1,84,12],[85,1,85,12],[72,1,72,12],[73,1,73,12],[77,1,77,12],[78,1,78,11],[79,1,79,12],[64,1,64,12],[66,1,66,12],[67,1,67,12],[69,1,69,12],[70,1,70,12],[65,1,65,12],[68,1,68,12],[60,7,60,8],[63,11,63,12],[61,5,61,6],[62,11,62,12],[61,11,61,12],[42,1,42,3],[31,1,31,3],[31,8,31,9],[30,4,30,10],[59,2,59,3],[59,5,59,6],[59,7,59,8],[59,9,59,10],[44,1,44,12],[30,1,30,3],[32,1,32,3],[33,1,33,3],[34,1,34,3],[35,1,35,3],[37,11,37,12],[38,11,38,12],[39,11,39,12],[40,11,40,12],[41,11,41,12],[59,11,59,12],[58,2,58,6],[58,7,58,12],[37,8,37,9],[38,8,38,9],[62,9,62,10],[63,9,63,10],[61,2,61,3],[115,2,115,12],[116,2,116,12],[71,1,71,12],[74,1,74,12],[94,1,94,12],[97,1,97,4],[97,6,97,12],[87,1,87,12],[80,1,80,12],[88,1,88,12],[89,1,89,12],[60,11,60,12],[117,2,117,12],[118,2,118,12],[119,2,119,12],[104,6,104,12],[105,6,105,12],[95,1,95,12],[96,1,96,12],[114,2,114,12],[108,1,108,12],[98,6,98,12],[106,6,106,12],[98,1,98,4],[106,1,106,4],[99,1,99,4],[100,1,100,4],[101,1,101,4],[102,1,102,4],[103,1,103,4],[104,1,104,4],[105,1,105,4],[99,6,99,12],[100,6,100,12],[61,9,61,10],[125,2,125,12],[126,2,126,12],[127,2,127,12],[128,2,128,12],[129,2,129,12],[120,2,120,12],[121,2,121,12],[122,2,122,12],[123,2,123,12],[124,2,124,12]]}
[]
[null,null,null,null,{"$f":"Lists!K7","v":"Annual reporting of Mineral and Synthetic Lubrication and Industrial Oils and Waste Oils"}]
[null,null,null,null,"QUALITY REPORT"]
[null,null,null," "]
[null,{"$f":"CONCATENATE(\"Country: \", 'GETTING STARTED'!E9,\" (\",'GETTING STARTED'!G9,\")\")","v":"Country: Finland (FI)"},null,null,null,null,null,{"$f":"CONCATENATE(\"Reference year: \",'GETTING STARTED'!E10,IF('GETTING STARTED'!E10=2018,\" (only for voluntary reporting of 6 categories)\",\"\"))","v":"Reference year: 2021"}]
[]
{"$rows_left_out":125}
{"sheet":"ErrorLog","index":12,"n_rows":1,"n_cols":7,"rows_kept":1,"cut":false,"hidden":false,"merged":[]}
["Link to Error","Validation Rule","Cell","Sheet","Description","Severity","Former Color"]

{"sheet":"Changelog","index":13,"n_rows":11,"n_cols":7,"rows_kept":11,"cut":false,"hidden":true,"merged":[]}
["Version","Date","Change","Changed by","SheetName","Cell","REMARKS"]
["v00.m20","2022-04-01","Add macros version 20","CDD"]
["v00.m20","2022-04-01","Initialise Specific Setting Sheets (SSS)","CDD"]
["v00.m20","2022-04-01","Add informative sheet \"Validation rules\"","CDD","Validation rules"]
["v00.m20","2022-04-01","Change tab colours to style guide convention","CDD","Data tables and quality report"]
["v00.m20","2022-04-01","Change formulas to prevent \"0\" when there is no data","CDD","Table 1","P8-P11","=IF(TRIM(CONCATENATE(X8,AN8,AV8,BD8,BL8,AF8))=\"\",\"\",X8+AN8+AV8+BD8+BL8-AF8)"]
{"$rows_left_out":6}
{"sheet":"Lists","index":14,"n_rows":42,"n_cols":11,"rows_kept":42,"cut":false,"hidden":true,"merged":[[1,9,1,10],[5,9,5,10],[10,9,10,10],[15,9,15,10]]}
["Country label","Country code",null,"Valid flags","Label",null,"yes",null,null,"Textual variables","String"]
["Belgium","BE",null,"B","break in time series",null,"no",null,null,"Institutional names"]
["Bulgaria","BG",null,"E","estimated data",null,null,null,null,"Eurostat Text","Statistical Office of the European Union"]
["Czechia","CZ",null,"P","provisional",null,null,null,null,"Directorate Text","Directorate E: Sectoral and regional statistics"]
["Denmark","DK",null,"BE",null,null,null,null,null,"Unit Text","Unit E-2: Environmental statistics and accounts; sustainable development"]
["Germany","DE",null,"BP",null,null,null,null,null,"Data collection information"]
{"$rows_left_out":37}
{"sheet":"Locks","index":15,"n_rows":3,"n_cols":7,"rows_kept":3,"cut":false,"hidden":true,"merged":[]}
["Sheet Name","Top Left Cell","Bottom Right Cell","Row Step","Column Step","Lock Type","Focus Back To"]
["Table 1","S8","S11",1,999,"Formulas","G8"]
["Table 2","K19","S19",999,4,"Formulas","G8"]

{"sheet":"IsFormula","index":16,"n_rows":3,"n_cols":6,"rows_kept":3,"cut":false,"hidden":true,"merged":[]}
["Severity","Sheet Name","Top Left Cell","Bottom Right Cell","Row Step","Column Step"]
["Info","Table 1","S8","S11",1,999]
["Info","Table 2","K19","S19",999,4]

{"sheet":"Summations","index":17,"n_rows":105,"n_cols":11,"rows_kept":105,"cut":false,"hidden":true,"merged":[[6,5,6,6]]}
["Severity","Sheet Name","List of Cells\n (first block)","First Total Cell (first block)","Last Total Cell\n(Last block)","Row Block Repetition Step","Column Block Repetition Step","Greater or Equal","Valid Tolerance","Only if all data is available","Display text in error"]
["Error","Table 1","K10","S8","K8",1,999,"GE",0,"YES","Value of 'Waste oil generated' in section 2 should be larger than 'Separately collected waste oil' in section 3 column 'Dry oil'\")"]
[]
[]
[]
[]
{"$rows_left_out":100}
{"sheet":"Mandatory","index":18,"n_rows":8,"n_cols":9,"rows_kept":8,"cut":false,"hidden":true,"merged":[]}
["Severity","SheetName","Top Left Cell","Bottom Right Cell","Row Step","Column Step","Empty Is Valid If Footnote Exists","Footnote Shift From Value"]
["Error","GETTING STARTED","E9","E10",1,999,"NO",999,"STANDARD FOR ALL QUESTIONNAIRES"]
["Error","GETTING STARTED","D14","D22",2,999,"NO",999]
["Error","Table 1","G8","K10",1,4,"YES",3]
["Error","Table 1","O8","AI11",1,4,"YES",3]
["Error","Table 1","AM10","BK11",1,8,"YES",3]
{"$rows_left_out":3}
{"sheet":"MandatoryAtLeast","index":19,"n_rows":20,"n_cols":6,"rows_kept":20,"cut":false,"hidden":true,"merged":[]}
["Severity","Sheet Name","List of Cells","Mandatory at least X cells","Mandatory at most Y cells","Display text in error"]
["Error","Table 2","G8,G9,G10,G11,G19",1,999]
["Error","Table 2","O8,O9,O10,O11,O13,O14,O15,O16,O17,O18,O19",1,999]
[]
[]
[]
{"$rows_left_out":15}
{"sheet":"ForbiddenStrings","index":20,"n_rows":5,"n_cols":8,"rows_kept":5,"cut":false,"hidden":true,"merged":[]}
["Severity","SheetName","TopLeftCell","BottomRightCell","RowStep","ColumnStep","ForbiddenString","Display text in error"]
["Warning","Footnotes list","E9","E58",1,999,"not available","Please verify the explanatory note sufficiently explains why the data is not available"]
["Warning","Footnotes list","E9","E58",1,999,"not reported","Please verify the explanatory note sufficiently explains why the data is not available"]
["Warning","Footnotes list","E9","E58",1,999,"unavailable data","Please verify the explanatory note sufficiently explains why the data is not available"]
["Warning","Footnotes list","E9","E58",1,999,"no data available","Please verify the explanatory note sufficiently explains why the data is not available"]

{"sheet":"FootnoteContent","index":21,"n_rows":10,"n_cols":7,"rows_kept":10,"cut":false,"hidden":true,"merged":[]}
["Severity","SheetName","TopLeftCell","BottomRightCell","RowStep","ColumnStep","DistanceFromReferenceToText"]
["Error","Table 1","I8","AJ10",1,4,1]
["Error","Table 1","Q11","AJ11",1,4,1]
["Error","Table 1","AO10","BQ11",1,4,1]
["Error","Table 1","AS8","BQ9",1,8,1]
["Error","Table 2","I8","Q11",1,8,1]
{"$rows_left_out":5}
{"sheet":"MustNotBeNegative","index":22,"n_rows":10,"n_cols":6,"rows_kept":10,"cut":false,"hidden":true,"merged":[]}
["Severity","SheetName","TopLeftCell","BottomRightCell","RowStep","ColumnStep"]
["Error","Table 1","G8","K10",1,4]
["Error","Table 1","O8","AI11",1,4]
["Error","Table 1","AM10","BK11",1,8]
["Error","Table 1","AQ8","BO11",1,8]
["Error","Table 2","G8","O11",1,8]
{"$rows_left_out":5}
{"sheet":"IsNumeric","index":23,"n_rows":10,"n_cols":6,"rows_kept":10,"cut":false,"hidden":true,"merged":[]}
["Severity","SheetName","TopLeftCell","BottomRightCell","RowStep","ColumnStep"]
["Error","Table 1","G8","K10",1,4]
["Error","Table 1","O8","AI11",1,4]
["Error","Table 1","AM10","BK11",1,8]
["Error","Table 1","AQ8","BO11",1,8]
["Error","Table 2","G8","O11",1,8]
{"$rows_left_out":4}